Reaction Details
Target5-hydroxytryptamine receptor 3A/3B
LigandBDBM50005838
Substrate/Competitorn/a
Meas. Tech.ChEMBL_3004 (CHEMBL619794)
Ki 25±n/a nM
Citation Flynn, DLZabrowski, DLBecker, DPNosal, RVillamil, CIGullikson, GWMoummi, CYang, DC SC-53116: the first selective agonist at the newly identified serotonin 5-HT4 receptor subtype. J Med Chem35:1486-9 (1992) 5-hydroxytryptamine receptor 3A/3B
Name:5-hydroxytryptamine receptor 3A/3B
Type:n/a
Mol. Mass.:n/a
Description:ASSAY_ID of EBI is 2974
Components:This complex has 2 components.
Component 1
Name:5-hydroxytryptamine receptor 3B
Synonyms:5HT3B_RAT Serotonin (5-HT) receptor
Type:PROTEIN
Mol. Mass.:50328.78
Organism:Rattus norvegicus
Description:EBI_11885
Residue:437
Component 2
Name:5-hydroxytryptamine receptor 3A
Synonyms:5-HT3 5HT3A_RAT Htr3 Serotonin (5-HT) receptor | Zacopride site-R
Type:Enzyme Catalytic Domain
Mol. Mass.:55428.70
Organism:RAT
Description:5-HT3 HTR3A RAT::P35563
Residue:483
BDBM50005838
NameBDBM50005838
Synonyms:(exo) 4-Amino-5-chloro-2-ethoxy-N-(hexahydro-pyrrolizin-1-ylmethyl)-benzamide | CHEMBL36005
TypeSmall organic molecule
Emp. Form.C17H24ClN3O2
Mol. Mass.337.844
SMILESCCOc1cc(N)c(Cl)cc1C(=O)NCC1CCN2CCCC12