Reaction Details
TargetEndothelin receptor type B
LigandBDBM50368607
Substrate/Competitorn/a
Meas. Tech.ChEBML_64189
Ki 0.036000±n/a nM
Citation Doherty, AM Endothelin: a new challenge. J Med Chem35:1493-508 (1992) Endothelin receptor type B
Name:Endothelin receptor type B
Type:Enzyme Catalytic Domain
Mol. Mass.:49483.43
Organism:RAT
Description:ENDOTHELIN B EDNRB RAT::P21451
Residue:442
BDBM50368607
NameBDBM50368607
Synonyms:CHEMBL1790180
TypeSmall organic molecule
Emp. Form.C122H170N26O33S4
Mol. Mass.2657.07
SMILESCC[C@H](C)[C@H](NC(=O)[C@H](CC(O)=O)NC(=O)[C@H](CC(C)C)NC(=O)[C@H](Cc1cnc[nH]1)NC(=O)[C@@H]1CSSC[C@@H](N)C(=O)N[C@H]([C@@H](C)O)C(=O)N[C@H]2CSSC[C@@H](NC(=O)[C@H](CCC(O)=O)NC(=O)[C@H](CCCCN)NC(=O)[C@@H](CC(O)=O)NC(=O)[C@H](CCCCN)NC(=O)[C@@H](CCc3ccc(O)cc3)NC(=O)[C@@H](NC(=O)[C@@H](Cc3ccccc3)NC2=O)[C@H](C)O)C(=O)N[C@@H](C(C)C)C(=O)N[C@H](Cc2ccc(O)cc2)C(=O)N[C@@H](Cc2ccc(O)cc2)C(=O)N1)C(=O)N[C@@H]([C@@H](C)CC)C(=O)N[C@@H](Cc1c[nH]c2ccccc12)C(O)=O