Reaction Details
TargetEndothelin-1 receptor
LigandBDBM50000566
Substrate/Competitorn/a
Meas. Tech.ChEBML_64210
IC50 3700±n/a nM
Citation Doherty, AM Endothelin: a new challenge. J Med Chem35:1493-508 (1992) Endothelin-1 receptor
Name:Endothelin-1 receptor
Type:Enzyme Catalytic Domain
Mol. Mass.:48256.91
Organism:RAT
Description:ENDOTHELIN A EDNRA RAT::P26684
Residue:426
BDBM50000566
NameBDBM50000566
Synonyms:(S)-3-{(S)-2-[(R)-2-Acetylamino-3-(3H-imidazol-4-yl)-propionylamino]-4-methyl-pentanoylamino}-N-((S)-1-{(S)-1-[(S)-1-carboxy-2-(1H-indol-3-yl)-ethylcarbamoyl]-2-methyl-butylcarbamoyl}-2-methyl-butyl)-succinamic acid 3-{2-[2-Acetylamino-3-(3H-imidazol-4-yl)-propionylamino]-4-methyl-pentanoylamino}-N-(1-{1-[1-carboxy-2-(1H-indol-3-yl)-ethylcarbamoyl]-2-methyl-butylcarbamoyl}-2-methyl-butyl)-succinamic acid | CHEMBL289687
TypeSmall organic molecule
Emp. Form.C41H59N9O10
Mol. Mass.837.9615
SMILESCC[C@H](C)[C@H](NC(=O)[C@H](CC(O)=O)NC(=O)[C@H](CC(C)C)NC(=O)[C@@H](Cc1cnc[nH]1)NC(C)=O)C(=O)N[C@@H]([C@@H](C)CC)C(=O)N[C@@H](Cc1c[nH]c2ccccc12)C(O)=O