Reaction Details
TargetNeutrophil elastase
LigandBDBM50455992
Substrate/Competitorn/a
Meas. Tech.ChEMBL_63642 (CHEMBL675353)
IC50 18000±n/a nM
Citation Zembower, DEKam, CMPowers, JCZalkow, LH Novel anthraquinone inhibitors of human leukocyte elastase and cathepsin G. J Med Chem35:1597-605 (1992) Neutrophil elastase
Name:Neutrophil elastase
Type:Enzyme
Mol. Mass.:28532.38
Organism:Homo sapiens (Human)
Description:P08246
Residue:267
BDBM50455992
NameBDBM50455992
Synonyms:CHEBI:3687 | Chrysophanol
TypeSmall organic molecule
Emp. Form.C15H10O4
Mol. Mass.254.2375
SMILESCc1cc(O)c2C(=O)c3c(O)cccc3C(=O)c2c1