Reaction Details
TargetNeutrophil elastase
LigandBDBM50005900
Substrate/Competitorn/a
Meas. Tech.ChEMBL_63978 (CHEMBL677604)
Ki 1900±n/a nM
Citation Zembower, DEKam, CMPowers, JCZalkow, LH Novel anthraquinone inhibitors of human leukocyte elastase and cathepsin G. J Med Chem35:1597-605 (1992) Neutrophil elastase
Name:Neutrophil elastase
Type:Enzyme
Mol. Mass.:28532.38
Organism:Homo sapiens (Human)
Description:P08246
Residue:267
BDBM50005900
NameBDBM50005900
Synonyms:CHEMBL43983 | Carbonic acid 8-butoxycarbonyloxy-3-methyl-9,10-dioxo-9,10-dihydro-anthracen-1-yl ester butyl ester
TypeSmall organic molecule
Emp. Form.C25H26O8
Mol. Mass.454.4691
SMILESCCCCOC(=O)Oc1cccc2C(=O)c3cc(C)cc(OC(=O)OCCCC)c3C(=O)c12