Reaction Details
TargetNeutrophil elastase
LigandBDBM50005894
Substrate/Competitorn/a
Meas. Tech.ChEBML_63648
IC50 39000±n/a nM
Citation Zembower, DEKam, CMPowers, JCZalkow, LH Novel anthraquinone inhibitors of human leukocyte elastase and cathepsin G. J Med Chem35:1597-605 (1992) Neutrophil elastase
Name:Neutrophil elastase
Type:Enzyme
Mol. Mass.:28532.38
Organism:Homo sapiens (Human)
Description:P08246
Residue:267
BDBM50005894
NameBDBM50005894
Synonyms:2-Methylanthraquinone 2-methyl-9,10-anthraquinone CHEMBL21745 beta-methylanthraquinone
TypeSmall organic molecule
Emp. Form.C15H10O2
Mol. Mass.222.2387
SMILESCc1ccc2C(=O)c3ccccc3C(=O)c2c1