Reaction Details
TargetCathepsin G
LigandBDBM50005883
Substrate/Competitorn/a
Meas. Tech.ChEBML_45341
IC50 33000±n/a nM
Citation Zembower, DEKam, CMPowers, JCZalkow, LH Novel anthraquinone inhibitors of human leukocyte elastase and cathepsin G. J Med Chem35:1597-605 (1992) Cathepsin G
Name:Cathepsin G
Type:PROTEIN
Mol. Mass.:28860.08
Organism:Homo sapiens (Human)
Description:ChEMBL_1469016
Residue:255
BDBM50005883
NameBDBM50005883
Synonyms:1,8-Dihydroxy-2-pentyl-anthraquinone | CHEMBL40884
TypeSmall organic molecule
Emp. Form.C19H18O4
Mol. Mass.310.3438
SMILESCCCCCc1ccc2C(=O)c3cccc(O)c3C(=O)c2c1O