Reaction Details
TargetNeutrophil elastase
LigandBDBM50005898
Substrate/Competitorn/a
Meas. Tech.ChEMBL_63647 (CHEMBL675357)
IC50 5900±n/a nM
Citation Zembower, DEKam, CMPowers, JCZalkow, LH Novel anthraquinone inhibitors of human leukocyte elastase and cathepsin G. J Med Chem35:1597-605 (1992) Neutrophil elastase
Name:Neutrophil elastase
Type:Enzyme
Mol. Mass.:28532.38
Organism:Homo sapiens (Human)
Description:P08246
Residue:267
BDBM50005898
NameBDBM50005898
Synonyms:1,8-Dihydroxy-3-methyl-6-propoxy-anthraquinone | CHEMBL41902
TypeSmall organic molecule
Emp. Form.C18H16O5
Mol. Mass.312.3166
SMILESCCCOc1cc(O)c2C(=O)c3c(O)cc(C)cc3C(=O)c2c1