Reaction Details
TargetNeutrophil elastase
LigandBDBM50005901
Substrate/Competitorn/a
Meas. Tech.ChEMBL_96627 (CHEMBL705700)
IC50 11000±n/a nM
Citation Zembower, DEKam, CMPowers, JCZalkow, LH Novel anthraquinone inhibitors of human leukocyte elastase and cathepsin G. J Med Chem35:1597-605 (1992) Neutrophil elastase
Name:Neutrophil elastase
Type:Enzyme
Mol. Mass.:28532.38
Organism:Homo sapiens (Human)
Description:P08246
Residue:267
BDBM50005901
NameBDBM50005901
Synonyms:1-Hydroxy-2-methyl-anthraquinone 1-hydroxy-2-methylanthracene-9,10-dione | CHEMBL42302
TypeSmall organic molecule
Emp. Form.C15H10O3
Mol. Mass.238.2381
SMILESCc1ccc2C(=O)c3ccccc3C(=O)c2c1O