Reaction Details
TargetNeutrophil elastase
LigandBDBM50005891
Substrate/Competitorn/a
Meas. Tech.ChEBML_63648
IC50 8000±n/a nM
Citation Zembower, DEKam, CMPowers, JCZalkow, LH Novel anthraquinone inhibitors of human leukocyte elastase and cathepsin G. J Med Chem35:1597-605 (1992) Neutrophil elastase
Name:Neutrophil elastase
Type:Enzyme
Mol. Mass.:28532.38
Organism:Homo sapiens (Human)
Description:P08246
Residue:267
BDBM50005891
NameBDBM50005891
Synonyms:1,8-Dihydroxy-2-isobutyl-anthraquinone | CHEMBL43457
TypeSmall organic molecule
Emp. Form.C18H16O4
Mol. Mass.296.3172
SMILESCC(C)Cc1ccc2C(=O)c3cccc(O)c3C(=O)c2c1O