Reaction Details
TargetNeutrophil elastase
LigandBDBM50005885
Substrate/Competitorn/a
Meas. Tech.ChEMBL_96627 (CHEMBL705700)
IC50 6000±n/a nM
Citation Zembower, DEKam, CMPowers, JCZalkow, LH Novel anthraquinone inhibitors of human leukocyte elastase and cathepsin G. J Med Chem35:1597-605 (1992) Neutrophil elastase
Name:Neutrophil elastase
Type:Enzyme
Mol. Mass.:28532.38
Organism:Homo sapiens (Human)
Description:P08246
Residue:267
BDBM50005885
NameBDBM50005885
Synonyms:2-Hexyl-1-hydroxy-8-methoxy-anthraquinone | CHEMBL40805
TypeSmall organic molecule
Emp. Form.C21H22O4
Mol. Mass.338.397
SMILESCCCCCCc1ccc2C(=O)c3cccc(OC)c3C(=O)c2c1O