Reaction Details
TargetNeutrophil elastase
LigandBDBM50005906
Substrate/Competitorn/a
Meas. Tech.ChEMBL_63644 (CHEMBL675355)
IC50 12000±n/a nM
Citation Zembower, DEKam, CMPowers, JCZalkow, LH Novel anthraquinone inhibitors of human leukocyte elastase and cathepsin G. J Med Chem35:1597-605 (1992) Neutrophil elastase
Name:Neutrophil elastase
Type:Enzyme
Mol. Mass.:28532.38
Organism:Homo sapiens (Human)
Description:P08246
Residue:267
BDBM50005906
NameBDBM50005906
Synonyms:Acetic acid 6,8-diacetoxy-2-methyl-9,10-dioxo-9,10-dihydro-anthracen-1-yl ester | CHEMBL40270
TypeSmall organic molecule
Emp. Form.C21H16O8
Mol. Mass.396.3469
SMILESCC(=O)Oc1cc(OC(C)=O)c2C(=O)c3c(OC(C)=O)c(C)ccc3C(=O)c2c1