Reaction Details
TargetNeutrophil elastase
LigandBDBM50005911
Substrate/Competitorn/a
Meas. Tech.ChEMBL_96627 (CHEMBL705700)
IC50>60000±n/a nM
Citation Zembower, DEKam, CMPowers, JCZalkow, LH Novel anthraquinone inhibitors of human leukocyte elastase and cathepsin G. J Med Chem35:1597-605 (1992) Neutrophil elastase
Name:Neutrophil elastase
Type:Enzyme
Mol. Mass.:28532.38
Organism:Homo sapiens (Human)
Description:P08246
Residue:267
BDBM50005911
NameBDBM50005911
Synonyms:1-Methoxy-2-methyl-anthraquinone | CHEMBL41178
TypeSmall organic molecule
Emp. Form.C16H12O3
Mol. Mass.252.2647
SMILESCOc1c(C)ccc2C(=O)c3ccccc3C(=O)c12