Reaction Details
TargetNeutrophil elastase
LigandBDBM50005914
Substrate/Competitorn/a
Meas. Tech.ChEMBL_63647 (CHEMBL675357)
IC50 13000±n/a nM
Citation Zembower, DEKam, CMPowers, JCZalkow, LH Novel anthraquinone inhibitors of human leukocyte elastase and cathepsin G. J Med Chem35:1597-605 (1992) Neutrophil elastase
Name:Neutrophil elastase
Type:Enzyme
Mol. Mass.:28532.38
Organism:Homo sapiens (Human)
Description:P08246
Residue:267
BDBM50005914
NameBDBM50005914
Synonyms:Acetic acid 3,8-diacetoxy-6-methyl-9,10-dioxo-9,10-dihydro-anthracen-1-yl ester emodin triacetate
TypeSmall organic molecule
Emp. Form.C21H16O8
Mol. Mass.396.3469
SMILESCC(=O)Oc1cc(OC(C)=O)c2C(=O)c3c(OC(C)=O)cc(C)cc3C(=O)c2c1