Reaction Details
TargetNeutrophil elastase
LigandBDBM50005910
Substrate/Competitorn/a
Meas. Tech.ChEMBL_63643 (CHEMBL675354)
IC50 17000±n/a nM
Citation Zembower, DEKam, CMPowers, JCZalkow, LH Novel anthraquinone inhibitors of human leukocyte elastase and cathepsin G. J Med Chem35:1597-605 (1992) Neutrophil elastase
Name:Neutrophil elastase
Type:Enzyme
Mol. Mass.:28532.38
Organism:Homo sapiens (Human)
Description:P08246
Residue:267
BDBM50005910
NameBDBM50005910
Synonyms:3-Dibromomethyl-1,6,8-trimethoxy-anthraquinone | CHEMBL39204
TypeSmall organic molecule
Emp. Form.C18H14Br2O5
Mol. Mass.470.109
SMILESCOc1cc(OC)c2C(=O)c3c(OC)cc(cc3C(=O)c2c1)C(Br)Br