Reaction Details
TargetPlatelet-activating factor receptor
LigandBDBM50006061
Substrate/Competitorn/a
Meas. Tech.ChEBML_221704
IC50 210±n/a nM
Citation Wissner, ACarroll, MLGreen, KEKerwar, SSPickett, WCSchaub, RETorley, LWWrenn, SKohler, CA Analogues of platelet activating factor. 6. Mono- and bis-aryl phosphate antagonists of platelet activating factor. J Med Chem35:1650-62 (1992) Platelet-activating factor receptor
Name:Platelet-activating factor receptor
Type:Protein
Mol. Mass.:39005.63
Organism:Cavia porcellus
Description:n/a
Residue:342
BDBM50006061
NameBDBM50006061
Synonyms:3-{3-[Hydroxy-(2,3,6-trimethyl-4-tetradecyloxy-phenoxy)-phosphoryloxy]-benzyl}-5-methyl-thiazol-3-ium | CHEMBL295379
TypeSmall organic molecule
Emp. Form.C34H50NO5PS
Mol. Mass.615.803
c1cc(C)c(OP([O-])(=O)Oc2cccc(C[n+]3csc(C)c3)c2)c(C)c1C