Reaction Details
Target5-hydroxytryptamine receptor 1A
LigandBDBM50047137
Substrate/Competitorn/a
Meas. Tech.ChEBML_581
Ki 1±n/a nM
Citation Chidester, CGLin, CHLahti, RAHaadsma-Svensson, SRSmith, MW Comparison of 5-HT1A and dopamine D2 pharmacophores. X-ray structures and affinities of conformationally constrained ligands. J Med Chem36:1301-15 (1993) 5-hydroxytryptamine receptor 1A
Name:5-hydroxytryptamine receptor 1A
Type:n/a
Mol. Mass.:46122.49
Organism:Homo sapiens (Human)
Description:n/a
Residue:422
BDBM50047137
NameBDBM50047137
Synonyms:(2 alpha-methyl) 9-Methoxy-2-methyl-3-propyl-2,3,3a,4,5,9b-hexahydro-1H-benzo[e]indole | CHEMBL24622
TypeSmall organic molecule
Emp. Form.C17H25NO
Mol. Mass.259.3865
SMILESCCCN1[C@@H](C)C[C@@H]2[C@H]1CCc1cccc(OC)c21