Reaction Details
TargetD(2) dopamine receptor
LigandBDBM50034334
Substrate/Competitorn/a
Meas. Tech.ChEBML_59890
Ki 235±n/a nM
Citation Chidester, CGLin, CHLahti, RAHaadsma-Svensson, SRSmith, MW Comparison of 5-HT1A and dopamine D2 pharmacophores. X-ray structures and affinities of conformationally constrained ligands. J Med Chem36:1301-15 (1993) D(2) dopamine receptor
Name:D(2) dopamine receptor
Type:Cell-surface receptors
Mol. Mass.:50647.10
Organism:Homo sapiens (Human)
Description:P14416
Residue:443
BDBM50034334
NameBDBM50034334
Synonyms:(3aR,9aR)-1-Allyl-2,3,3a,4,9,9a-hexahydro-1H-benzo[f]indol-5-ol CHEMBL24050
TypeSmall organic molecule
Emp. Form.C15H19NO
Mol. Mass.229.3175
SMILESOc1cccc2C[C@@H]3[C@@H](CCN3CC=C)Cc12