Reaction Details
TargetcGMP-specific 3',5'-cyclic phosphodiesterase
LigandBDBM50045022
Substrate/Competitorn/a
Meas. Tech.ChEBML_154415
IC50 64000±n/a nM
Citation Coates, WJConnolly, BDhanak, DFlynn, STWorby, A Cyclic nucleotide phosphodiesterase inhibition by imidazopyridines: analogues of sulmazole and isomazole as inhibitors of the cGMP specific phosphodiesterase. J Med Chem36:1387-92 (1993) cGMP-specific 3',5'-cyclic phosphodiesterase
Name:cGMP-specific 3',5'-cyclic phosphodiesterase
Type:Protein
Mol. Mass.:99975.83
Organism:Homo sapiens (Human)
Description:O76074
Residue:875
BDBM50045022
NameBDBM50045022
Synonyms:2-[2-(3H-Imidazo[4,5-b]pyridin-2-yl)-phenoxy]-ethanol | CHEMBL31964
TypeSmall organic molecule
Emp. Form.C14H13N3O2
Mol. Mass.255.2719
SMILESOCCOc1ccccc1-c1nc2ncccc2[nH]1