Reaction Details
TargetcGMP-specific 3',5'-cyclic phosphodiesterase
LigandBDBM50045016
Substrate/Competitorn/a
Meas. Tech.ChEBML_154415
IC50 3000±n/a nM
Citation Coates, WJConnolly, BDhanak, DFlynn, STWorby, A Cyclic nucleotide phosphodiesterase inhibition by imidazopyridines: analogues of sulmazole and isomazole as inhibitors of the cGMP specific phosphodiesterase. J Med Chem36:1387-92 (1993) cGMP-specific 3',5'-cyclic phosphodiesterase
Name:cGMP-specific 3',5'-cyclic phosphodiesterase
Type:Protein
Mol. Mass.:99975.83
Organism:Homo sapiens (Human)
Description:O76074
Residue:875
BDBM50045016
NameBDBM50045016
Synonyms:2-(2-Isobutoxy-phenyl)-3H-imidazo[4,5-b]pyridine | CHEMBL286021
TypeSmall organic molecule
Emp. Form.C16H17N3O
Mol. Mass.267.3257
SMILESCC(C)COc1ccccc1-c1nc2ncccc2[nH]1