Reaction Details
TargetcGMP-specific 3',5'-cyclic phosphodiesterase
LigandBDBM50045012
Substrate/Competitorn/a
Meas. Tech.ChEBML_154415
IC50 1000±n/a nM
Citation Coates, WJConnolly, BDhanak, DFlynn, STWorby, A Cyclic nucleotide phosphodiesterase inhibition by imidazopyridines: analogues of sulmazole and isomazole as inhibitors of the cGMP specific phosphodiesterase. J Med Chem36:1387-92 (1993) cGMP-specific 3',5'-cyclic phosphodiesterase
Name:cGMP-specific 3',5'-cyclic phosphodiesterase
Type:Protein
Mol. Mass.:99975.83
Organism:Homo sapiens (Human)
Description:O76074
Residue:875
BDBM50045012
NameBDBM50045012
Synonyms:2-(2-Pentyloxy-phenyl)-3H-imidazo[4,5-b]pyridine | CHEMBL28871
TypeSmall organic molecule
Emp. Form.C17H19N3O
Mol. Mass.281.3523
SMILESCCCCCOc1ccccc1-c1nc2ncccc2[nH]1