Reaction Details
TargetcAMP-specific 3',5'-cyclic phosphodiesterase 4A/4B/4C/4D
LigandBDBM50045014
Substrate/Competitorn/a
Meas. Tech.ChEMBL_154410 (CHEMBL759172)
IC50 37000±n/a nM
Citation Coates, WJConnolly, BDhanak, DFlynn, STWorby, A Cyclic nucleotide phosphodiesterase inhibition by imidazopyridines: analogues of sulmazole and isomazole as inhibitors of the cGMP specific phosphodiesterase. J Med Chem36:1387-92 (1993) cAMP-specific 3',5'-cyclic phosphodiesterase 4A/4B/4C/4D
Name:cAMP-specific 3',5'-cyclic phosphodiesterase 4A/4B/4C/4D
Synonyms:Phosphodiesterase 4
Type:n/a
Mol. Mass.:n/a
Description:ASSAY_ID of ChEMBL is 788178
Components:This complex has 4 components.
Component 1
Name:cAMP-specific 3',5'-cyclic phosphodiesterase 4A
Type:Enzyme
Mol. Mass.:98113.27
Organism:Homo sapiens (Human)
Description:P27815
Residue:886
Component 2
Name:cAMP-specific 3',5'-cyclic phosphodiesterase 4D
Synonyms:3',5'-cyclic phosphodiesterase PDE43 PDE4D_HUMAN | Phosphodiesterase 4D
Type:Protein
Mol. Mass.:91092.69
Organism:Homo sapiens (Human)
Description:Q08499
Residue:809
Component 3
Name:cAMP-specific 3',5'-cyclic phosphodiesterase 4B
Synonyms:3',5'-cyclic phosphodiesterase Isoform PDE4B1 PDE4B PDE4B_HUMAN Phosphodiesterase 4B (PDE4B) Phosphodiesterase Type 4 (PDE4B)
Type:Protein
Mol. Mass.:83318.87
Organism:Homo sapiens (Human)
Description:Q07343
Residue:736
Component 4
Name:cAMP-specific 3',5'-cyclic phosphodiesterase 4C
Synonyms:3',5'-cyclic phosphodiesterase NP_000914.2 PDE4C | PDE4C1
Type:Enzyme Catalytic Domain
Mol. Mass.:79875.54
Organism:Homo sapiens (Human)
Description:Q08493
Residue:712
BDBM50045014
NameBDBM50045014
Synonyms:2-(2-Cyclopropylmethoxy-phenyl)-3H-imidazo[4,5-b]pyridine | CHEMBL28835
TypeSmall organic molecule
Emp. Form.C16H15N3O
Mol. Mass.265.3098
SMILESC(Oc1ccccc1-c1nc2ncccc2[nH]1)C1CC1