Reaction Details
TargetAngiotensin-converting enzyme
LigandBDBM50367254
Substrate/Competitorn/a
Meas. Tech.ChEBML_36748
IC50 1.2±n/a nM
Citation Patchett, AA Excursions in drug discovery. J Med Chem36:2051-8 (1993) Angiotensin-converting enzyme
Name:Angiotensin-converting enzyme
Type:Enzyme
Mol. Mass.:149709.01
Organism:Homo sapiens (Human)
Description:n/a
Residue:1306
BDBM50367254
NameBDBM50367254
Synonyms:ENALAPRILAT
TypeSmall organic molecule
Emp. Form.C18H24N2O5
Mol. Mass.348.3936
SMILESC[C@H](N[C@@H](CCc1ccccc1)C(O)=O)C(=O)N1CCC[C@H]1C(O)=O