Reaction Details
TargetGastrin/cholecystokinin type B receptor
LigandBDBM81962
Substrate/Competitorn/a
Meas. Tech.ChEBML_48760
IC50 2±n/a nM
Citation Patchett, AA Excursions in drug discovery. J Med Chem36:2051-8 (1993) Gastrin/cholecystokinin type B receptor
Name:Gastrin/cholecystokinin type B receptor
Type:G Protein-Coupled Receptor (GPCR)
Mol. Mass.:48445.79
Organism:Homo sapiens (Human)
Description:Stable expression of human CCK-2 receptors in HEK 293 cells.
Residue:447
BDBM81962
NameBDBM81962
Synonyms:S-L-365,260
Typen/a
Emp. Form.C24H22N4O2
Mol. Mass.398.4571
SMILESCN1c2ccccc2C(=N[C@@H](NC(=O)Nc2cccc(C)c2)C1=O)c1ccccc1