Reaction Details
TargetDelta-type opioid receptor
LigandBDBM50027433
Substrate/Competitorn/a
Meas. Tech.ChEMBL_145188 (CHEMBL754288)
IC50>10000±n/a nM
Citation Naylor, AJudd, DBLloyd, JEScopes, DIHayes, AGBirch, PJ A potent new class of kappa-receptor agonist: 4-substituted 1-(arylacetyl)-2-[(dialkylamino)methyl]piperazines. J Med Chem36:2075-83 (1993) Delta-type opioid receptor
Name:Delta-type opioid receptor
Type:G Protein-Coupled Receptor (GPCR)
Mol. Mass.:40382.98
Organism:Homo sapiens (Human)
Description:Competition binding assays were carried out using membrane preparations from transfected HN9.10 cells that constitutively expressed the delta opioid receptor.
Residue:372
BDBM50027433
NameBDBM50027433
Synonyms:CHEMBL603370 | GR-89696
TypeSmall organic molecule
Emp. Form.C19H25Cl2N3O3
Mol. Mass.414.326
SMILESCOC(=O)N1CCN(C(CN2CCCC2)C1)C(=O)Cc1ccc(Cl)c(Cl)c1