Reaction Details
TargetSigma non-opioid intracellular receptor 1
LigandBDBM50044713
Substrate/Competitorn/a
Meas. Tech.ChEBML_201723
Ki 0.980000±n/a nM
Citation de Costa, BRHe, XSLinders, JTDominguez, CGu, ZQWilliams, WBowen, WD Synthesis and evaluation of conformationally restricted N-[2-(3,4-dichlorophenyl)ethyl]-N-methyl-2-(1-pyrrolidinyl)ethylamines at sigma receptors. 2. Piperazines, bicyclic amines, bridged bicyclic amines, and miscellaneous compounds. J Med Chem36:2311-20 (1993) Sigma non-opioid intracellular receptor 1
Name:Sigma non-opioid intracellular receptor 1
Type:Enzyme Catalytic Domain
Mol. Mass.:25124.85
Organism:Homo sapiens (Human)
Description:Q99720
Residue:223
BDBM50044713
NameBDBM50044713
Synonyms:2-[2-(3,4-Dichloro-phenyl)-ethyl]-octahydro-pyrido[1,2-a]pyrazine | CHEMBL309062
TypeSmall organic molecule
Emp. Form.C16H22Cl2N2
Mol. Mass.313.265
SMILESClc1ccc(CCN2CCN3CCCCC3C2)cc1Cl