Reaction Details
TargetType-1 angiotensin II receptor A
LigandBDBM50003156
Substrate/Competitorn/a
Meas. Tech.ChEBML_36154
Ki 15±n/a nM
Citation Winn, MDe, BZydowsky, TMAltenbach, RJBasha, FZBoyd, SABrune, MEBuckner, SACrowell, DDrizin, I 2-(Alkylamino)nicotinic acid and analogs. Potent angiotensin II antagonists. J Med Chem36:2676-88 (1993) Type-1 angiotensin II receptor A
Name:Type-1 angiotensin II receptor A
Type:Enzyme Catalytic Domain
Mol. Mass.:40910.53
Organism:RAT
Description:ANGIOTENSIN AT1 AGTR1 RAT::P25095
Residue:359
BDBM50003156
NameBDBM50003156
Synonyms:4-{Butyl-[2''-(1H-tetrazol-5-yl)-biphenyl-4-ylmethyl]-amino}-2-methyl-pyrimidine-5-carboxylic acid;Hydro chloride CHEMBL1237156 | CHEMBL124772
TypeSmall organic molecule
Emp. Form.C24H25N7O2
Mol. Mass.443.501
SMILESCCCCN(Cc1ccc(cc1)-c1ccccc1-c1nnn[nH]1)c1nc(C)ncc1C(O)=O