Reaction Details
Target5-hydroxytryptamine receptor 3A/3B
LigandBDBM85330
Substrate/Competitorn/a
Meas. Tech.ChEMBL_2996 (CHEMBL619787)
Ki 6.5±n/a nM
Citation Monge, APalop, JADel Castillo, JCCalderó, JMRoca, JRomero, GDel Río, JLasheras, B Novel antagonists of 5-HT3 receptors. Synthesis and biological evaluation of piperazinylquinoxaline derivatives. J Med Chem36:2745-50 (1993) 5-hydroxytryptamine receptor 3A/3B
Name:5-hydroxytryptamine receptor 3A/3B
Type:n/a
Mol. Mass.:n/a
Description:ASSAY_ID of EBI is 2974
Components:This complex has 2 components.
Component 1
Name:5-hydroxytryptamine receptor 3B
Synonyms:5HT3B_RAT Serotonin (5-HT) receptor
Type:PROTEIN
Mol. Mass.:50328.78
Organism:Rattus norvegicus
Description:EBI_11885
Residue:437
Component 2
Name:5-hydroxytryptamine receptor 3A
Synonyms:5-HT3 5HT3A_RAT Htr3 Serotonin (5-HT) receptor | Zacopride site-R
Type:Enzyme Catalytic Domain
Mol. Mass.:55428.70
Organism:RAT
Description:5-HT3 HTR3A RAT::P35563
Residue:483
BDBM85330
NameBDBM85330
Synonyms:CAS_68647 ONDANSETRON | Ondansetron hydrochloride
TypeSmall organic molecule
Emp. Form.C18H19N3O
Mol. Mass.293.363
SMILESCc1nccn1CC1CCc2c(C1=O)c1ccccc1n2C