Reaction Details
TargetSerotonin 2 (5-HT2) receptor
LigandBDBM50368661
Substrate/Competitorn/a
Meas. Tech.ChEMBL_1938 (CHEMBL617246)
IC50 75±n/a nM
Citation Bøgesø, KPArnt, JHyttel, JPedersen, H Stereospecific and selective 5-HT2 antagonism in a series of 5-substituted trans-1-piperazino-3-phenylindans. J Med Chem36:2761-70 (1993) Serotonin 2 (5-HT2) receptor
Name:Serotonin 2 (5-HT2) receptor
Synonyms:5-hydroxytryptamine receptor 2A/2B/2C
Type:n/a
Mol. Mass.:n/a
Description:ASSAY_ID of ChEMBL is 2197419
Components:This complex has 3 components.
Component 1
Name:5-hydroxytryptamine receptor 2B
Type:Enzyme Catalytic Domain
Mol. Mass.:53668.47
Organism:RAT
Description:5-HT2B HTR2B RAT::P30994
Residue:479
Component 2
Name:5-hydroxytryptamine receptor 2C
Synonyms:5-HT2C 5-hydroxytryptamine receptor 2C (5HT2c) 5ht1c Htr2c Serotonin receptor 2a and 2c (5HT2A and 5HT2C)
Type:Enzyme
Mol. Mass.:51935.10
Organism:Rattus norvegicus (Rat)
Description:P08909
Residue:460
Component 3
Name:5-hydroxytryptamine receptor 2A
Synonyms:5-HT-2A 5-HT2A 5-hydroxytryptamine receptor 2A (5HT2A) Htr2 Serotonin Receptor 2A
Type:G Protein-Coupled Receptor (GPCR)
Mol. Mass.:52852.05
Organism:Rattus norvegicus (rat)
Description:Rat cortex membranes 5-HT2A receptors.
Residue:471
BDBM50368661
NameBDBM50368661
Synonyms:CHEMBL1744121
TypeSmall organic molecule
Emp. Form.C27H34ClFN4O
Mol. Mass.485.036
SMILESCC(C)N1CCN(CCN2CCN(CC2)C2CC(c3cc(Cl)ccc23)c2ccc(F)cc2)C1=O