Reaction Details
TargetD(3) dopamine receptor
LigandBDBM50041469
Substrate/Competitorn/a
Meas. Tech.ChEBML_62771
Ki 125±n/a nM
Citation Zhuang, ZPKung, MPKung, HF Synthesis of (R,S)-trans-8-hydroxy-2-[N-n-propyl-N-(3'-iodo-2'-propenyl)amino]tetral in (trans-8-OH-PIPAT): a new 5-HT1A receptor ligand. J Med Chem36:3161-5 (1993) D(3) dopamine receptor
Name:D(3) dopamine receptor
Type:Protein
Mol. Mass.:49540.58
Organism:Rattus norvegicus (Rat)
Description:P19020
Residue:446
BDBM50041469
NameBDBM50041469
Synonyms:(R,S) 7-[(3-Iodo-allyl)-propyl-amino]-5,6,7,8-tetrahydro-naphthalen-1-ol CHEMBL284716
TypeSmall organic molecule
Emp. Form.C16H22INO
Mol. Mass.371.2565
SMILESCCCN(C\C=C\I)C1CCc2cccc(O)c2C1