Reaction Details
TargetD(2) dopamine receptor
LigandBDBM50034366
Substrate/Competitorn/a
Meas. Tech.ChEBML_62228
Ki 670±n/a nM
Citation Sonesson, CBoije, MSvensson, KEkman, ACarlsson, ARomero, AGMartin, IJDuncan, JNKing, LJWikström, H Orally active central dopamine and serotonin receptor ligands: 5-, 6-, 7-, and 8-[[trifluoromethyl)sulfonyl]oxy]-2-(di-n-propylamino)tetralins and the formation of active metabolites in vivo. J Med Chem36:3409-16 (1993) D(2) dopamine receptor
Name:D(2) dopamine receptor
Type:G Protein-Coupled Receptor (GPCR)
Mol. Mass.:50931.60
Organism:Rattus norvegicus (rat)
Description:P61169
Residue:444
BDBM50034366
NameBDBM50034366
Synonyms:CHEMBL28437 | Trifluoro-methanesulfonic acid 7-dipropylamino-5,6,7,8-tetrahydro-naphthalen-1-yl ester
TypeSmall organic molecule
Emp. Form.C17H24F3NO3S
Mol. Mass.379.438
SMILESCCCN(CCC)C1CCc2cccc(OS(=O)(=O)C(F)(F)F)c2C1