Reaction Details
TargetAdenosine kinase
LigandBDBM50368712
Substrate/Competitorn/a
Meas. Tech.ChEBML_30640
Ki 40±n/a nM
Citation Cottam, HBWasson, DBShih, HCRaychaudhuri, ADi Pasquale, GCarson, DA New adenosine kinase inhibitors with oral antiinflammatory activity: synthesis and biological evaluation. J Med Chem36:3424-30 (1993) Adenosine kinase
Name:Adenosine kinase
Type:PROTEIN
Mol. Mass.:40545.97
Organism:Homo sapiens (Human)
Description:ChEMBL_1467841
Residue:362
BDBM50368712
NameBDBM50368712
Synonyms:CHEMBL608051
TypeSmall organic molecule
Emp. Form.C10H12IN5O4
Mol. Mass.393.1379
SMILESNc1ncnc2n(nc(I)c12)C1O[C@H](CO)[C@@H](O)[C@H]1O