Reaction Details
TargetMuscarinic acetylcholine receptor M2
LigandBDBM50042470
Substrate/Competitorn/a
Meas. Tech.ChEBML_98896
Ki 70.0±n/a nM
Citation Trybulski, EJZhang, JKramss, RHMangano, RM The synthesis and biochemical pharmacology of enantiomerically pure methylated oxotremorine derivatives. J Med Chem36:3533-41 (1994) Muscarinic acetylcholine receptor M2
Name:Muscarinic acetylcholine receptor M2
Type:Enzyme Catalytic Domain
Mol. Mass.:51555.53
Organism:RAT
Description:P10980
Residue:466
BDBM50042470
NameBDBM50042470
Synonyms:1-(4-Piperidin-1-yl-but-2-ynyl)-pyrrolidin-2-one | CHEMBL118240
TypeSmall organic molecule
Emp. Form.C13H20N2O
Mol. Mass.220.3107
SMILESO=C1CCCN1CC#CCN1CCCCC1