Reaction Details
TargetMuscarinic acetylcholine receptor M2
LigandBDBM50042466
Substrate/Competitorn/a
Meas. Tech.ChEMBL_98894 (CHEMBL703402)
Ki 260±n/a nM
Citation Trybulski, EJZhang, JKramss, RHMangano, RM The synthesis and biochemical pharmacology of enantiomerically pure methylated oxotremorine derivatives. J Med Chem36:3533-41 (1994) Muscarinic acetylcholine receptor M2
Name:Muscarinic acetylcholine receptor M2
Type:Enzyme Catalytic Domain
Mol. Mass.:51555.53
Organism:RAT
Description:P10980
Residue:466
BDBM50042466
NameBDBM50042466
Synonyms:1-(4-Dimethylamino-but-2-ynyl)-3-methyl-pyrrolidin-2-one | CHEMBL442206
TypeSmall organic molecule
Emp. Form.C11H18N2O
Mol. Mass.194.2734
SMILESCC1CCN(CC#CCN(C)C)C1=O