Reaction Details
TargetAmine oxidase [flavin-containing] B
LigandBDBM50368737
Substrate/Competitorn/a
Meas. Tech.ChEBML_99764
Ki 13300000±n/a nM
Citation Ding, CZSilverman, RB Transformation of heterocyclic reversible monoamine oxidase-B inactivators into irreversible inactivators by N-methylation. J Med Chem36:3606-10 (1994) Amine oxidase [flavin-containing] B
Name:Amine oxidase [flavin-containing] B
Type:PROTEIN
Mol. Mass.:58428.94
Organism:Bos taurus
Description:ChEMBL_1501478
Residue:520
BDBM50368737
NameBDBM50368737
Synonyms:CHEMBL1203215
TypeSmall organic molecule
Emp. Form.C13H18N2O3
Mol. Mass.250.2936
SMILESCOc1ccc(cc1)N1CC(CN(C)C)OC1=O