Reaction Details
TargetAmine oxidase [flavin-containing] B
LigandBDBM50042587
Substrate/Competitorn/a
Meas. Tech.ChEBML_99764
Ki 6700000±n/a nM
Citation Ding, CZSilverman, RB Transformation of heterocyclic reversible monoamine oxidase-B inactivators into irreversible inactivators by N-methylation. J Med Chem36:3606-10 (1994) Amine oxidase [flavin-containing] B
Name:Amine oxidase [flavin-containing] B
Type:PROTEIN
Mol. Mass.:58428.94
Organism:Bos taurus
Description:ChEMBL_1501478
Residue:520
BDBM50042587
NameBDBM50042587
Synonyms:5-Aminomethyl-3-(4-methoxy-phenyl)-dihydro-furan-2-one | CHEMBL332821
TypeSmall organic molecule
Emp. Form.C12H15NO3
Mol. Mass.221.2524
SMILESCOc1ccc(cc1)C1CC(CN)OC1=O