Reaction Details
TargetAmine oxidase [flavin-containing] B
LigandBDBM50042592
Substrate/Competitorn/a
Meas. Tech.ChEBML_99764
Ki 200000±n/a nM
Citation Ding, CZSilverman, RB Transformation of heterocyclic reversible monoamine oxidase-B inactivators into irreversible inactivators by N-methylation. J Med Chem36:3606-10 (1994) Amine oxidase [flavin-containing] B
Name:Amine oxidase [flavin-containing] B
Type:PROTEIN
Mol. Mass.:58428.94
Organism:Bos taurus
Description:ChEMBL_1501478
Residue:520
BDBM50042592
NameBDBM50042592
Synonyms:3-[4-(3-Chloro-benzyloxy)-phenyl]-5-methylaminomethyl-oxazolidin-2-one;hydrochloride | CHEMBL326373
TypeSmall organic molecule
Emp. Form.C18H19ClN2O3
Mol. Mass.346.808
SMILESCNCC1CN(C(=O)O1)c1ccc(OCc2cccc(Cl)c2)cc1