Reaction Details
TargetAdenosine receptor A1
LigandBDBM50006710
Substrate/Competitorn/a
Meas. Tech.ChEMBL_29140 (CHEMBL637561)
Ki 430±n/a nM
Citation Nonaka, YShimada, JNonaka, HKoike, NAoki, NKobayashi, HKase, HYamaguchi, KSuzuki, F Photoisomerization of a potent and selective adenosine A2 antagonist, (E)-1,3-Dipropyl-8-(3,4-dimethoxystyryl)-7-methylxanthine. J Med Chem36:3731-3 (1994) Adenosine receptor A1
Name:Adenosine receptor A1
Type:Protein
Mol. Mass.:36704.13
Organism:Rattus norvegicus (rat)
Description:n/a
Residue:326
BDBM50006710
NameBDBM50006710
Synonyms:8-[(E)-2-(3,4-Dimethoxy-phenyl)-vinyl]-7-methyl-1,3-dipropyl-3,7-dihydro-purine-2,6-dione 8-[2-(3,4-Dimethoxy-phenyl)-vinyl]-7-methyl-1,3-dipropyl-3,7-dihydro-purine-2,6-dione; compound with 8-[2-(3,4-dimethoxy-phenyl)-vinyl]-7-methyl-1,3-dipropyl-3,7-dihydro-purine-2,6-dione CHEMBL27508 | KF-17837
TypeSmall organic molecule
Emp. Form.C22H28N4O4
Mol. Mass.412.4821
SMILESCCCn1c2nc(\C=C\c3ccc(OC)c(OC)c3)n(C)c2c(=O)n(CCC)c1=O