Reaction Details
TargetVoltage-dependent L-type calcium channel subunit alpha-1C
LigandBDBM50231571
Substrate/Competitorn/a
Meas. Tech.ChEMBL_92774 (CHEMBL700074)
Ki 2.2±n/a nM
Citation Baindur, NRutledge, ATriggle, DJ A homologous series of permanently charged 1,4-dihydropyridines: novel probes designed to localize drug binding sites on ion channels. J Med Chem36:3743-5 (1994) Voltage-dependent L-type calcium channel subunit alpha-1C
Name:Voltage-dependent L-type calcium channel subunit alpha-1C
Type:Enzyme Catalytic Domain
Mol. Mass.:243492.26
Organism:RAT
Description:Calcium channel 0 RAT::P22002
Residue:2169
BDBM50231571
NameBDBM50231571
Synonyms:CHEMBL3350845
TypeSmall organic molecule
Emp. Form.C21H24F3NO4
Mol. Mass.411.4148
SMILESCCCCOC(=O)C1=C(C)NC(C)=C(C1c1ccccc1C(F)(F)F)C(=O)OC