Reaction Details
TargetRibonucleoside-diphosphate reductase large subunit
LigandBDBM50368751
Substrate/Competitorn/a
Meas. Tech.ChEMBL_195540 (CHEMBL800987)
IC50 9000±n/a nM
Citation Fisher, AYang, FDRubin, HCooperman, BS R2 C-terminal peptide inhibition of mammalian and yeast ribonucleotide reductase. J Med Chem36:3859-62 (1994) Ribonucleoside-diphosphate reductase large subunit
Name:Ribonucleoside-diphosphate reductase large subunit
Type:PROTEIN
Mol. Mass.:90210.73
Organism:Mus musculus
Description:ChEMBL_195411
Residue:792
BDBM50368751
NameBDBM50368751
Synonyms:CHEMBL1790907
TypeSmall organic molecule
Emp. Form.C48H66N10O18
Mol. Mass.1071.0938
SMILESCC(C)C[C@H](NC(=O)[C@@H](NC(=O)[C@H](Cc1ccccc1)NC(=O)[C@H](CO)NC(=O)[C@H](CC(N)=O)NC(C)=O)[C@H](C)O)C(=O)N[C@@H](CC(O)=O)C(=O)N[C@@H](C)C(=O)N[C@@H](CC(O)=O)C(=O)N[C@@H](Cc1ccccc1)C(O)=O