Reaction Details
TargetMultidrug transporter MdfA
LigandBDBM50046492
Substrate/Competitorn/a
Meas. Tech.ChEMBL_68323 (CHEMBL680694)
IC50 1000±n/a nM
Citation Nelson, MLPark, BHAndrews, JSGeorgian, VAThomas, RCLevy, SB Inhibition of the tetracycline efflux antiport protein by 13-thio-substituted 5-hydroxy-6-deoxytetracyclines. J Med Chem36:370-7 (1993) Multidrug transporter MdfA
Name:Multidrug transporter MdfA
Type:PROTEIN
Mol. Mass.:44327.48
Organism:Escherichia coli (strain K12)
Description:ChEMBL_68323
Residue:410
BDBM50046492
NameBDBM50046492
Synonyms:6-Cyclopentylsulfanylmethyl-4-dimethylamino-3,5,10,12,12a-pentahydroxy-1,11-dioxo-1,4,4a,5,5a,6,11,12a-octahydro-naphthacene-2-carboxylic acid (morpholin-4-ylmethyl)-amide | CHEMBL334080
TypeSmall organic molecule
Emp. Form.C32H41N3O9S
Mol. Mass.643.748
SMILESCN(C)[C@H]1C2[C@@H](O)C3[C@@H](CSC4CCCC4)c4cccc(O)c4C(=O)C3C(=O)[C@]2(O)C(=O)C(C(=O)NCN2CCOCC2)C1=O