Reaction Details
TargetMultidrug transporter MdfA
LigandBDBM55038
Substrate/Competitorn/a
Meas. Tech.ChEMBL_68323 (CHEMBL680694)
IC50 2500±n/a nM
Citation Nelson, MLPark, BHAndrews, JSGeorgian, VAThomas, RCLevy, SB Inhibition of the tetracycline efflux antiport protein by 13-thio-substituted 5-hydroxy-6-deoxytetracyclines. J Med Chem36:370-7 (1993) Multidrug transporter MdfA
Name:Multidrug transporter MdfA
Type:PROTEIN
Mol. Mass.:44327.48
Organism:Escherichia coli (strain K12)
Description:ChEMBL_68323
Residue:410
BDBM55038
NameBDBM55038
Synonyms:(2E,4S,4aR,5S,5aR,12aS)-2-[amino(hydroxy)methylene]-4-(dimethylamino)-5,10,11,12a-tetrahydroxy-6-methylene-4,4a,5,5a-tetrahydrotetracene-1,3,12-trione;hydrochloride (2E,4S,4aR,5S,5aR,12aS)-2-[amino(hydroxy)methylidene]-4-(dimethylamino)-5,10,11,12a-tetrahydroxy-6-methylidene-4,4a,5,5a-tetrahydrotetracene-1,3,12-trione;hydrochloride (4S,4aR,5S,5aR,12aR)-4-(dimethylamino)-1,5,10,11,12a-pentahydroxy-3,12-diketo-6-methylene-4,4a,5,5a-tetrahydrotetracene-2-carboxamide;hydrochloride MLS001049011 SMR000387056 | cid_16196941
TypeSmall organic molecule
Emp. Form.C22H22N2O8
Mol. Mass.442.4187
SMILESCN(C)[C@H]1[C@@H]2[C@@H](O)[C@H]3C(C(=O)c4c(O)cccc4C3=C)C(=O)[C@]2(O)C(=O)C(C(N)=O)C1=O