Reaction Details
Target5-hydroxytryptamine receptor 3A/3B
LigandBDBM50047884
Substrate/Competitorn/a
Meas. Tech.ChEMBL_3237 (CHEMBL618923)
Ki 14±n/a nM
Citation Hayashi, HMiwa, YIchikawa, SYoda, NMiki, IIshii, AKono, MYasuzawa, TSuzuki, F 5-HT3 receptor antagonists. 2. 4-Hydroxy-3-quinolinecarboxylic acid derivatives. J Med Chem36:617-26 (1993) 5-hydroxytryptamine receptor 3A/3B
Name:5-hydroxytryptamine receptor 3A/3B
Type:n/a
Mol. Mass.:n/a
Description:ASSAY_ID of EBI is 2974
Components:This complex has 2 components.
Component 1
Name:5-hydroxytryptamine receptor 3B
Synonyms:5HT3B_RAT Serotonin (5-HT) receptor
Type:PROTEIN
Mol. Mass.:50328.78
Organism:Rattus norvegicus
Description:EBI_11885
Residue:437
Component 2
Name:5-hydroxytryptamine receptor 3A
Synonyms:5-HT3 5HT3A_RAT Htr3 Serotonin (5-HT) receptor | Zacopride site-R
Type:Enzyme Catalytic Domain
Mol. Mass.:55428.70
Organism:RAT
Description:5-HT3 HTR3A RAT::P35563
Residue:483
BDBM50047884
NameBDBM50047884
Synonyms:4-Hydroxy-2-oxo-1-phenyl-1,2-dihydro-[1,8]naphthyridine-3-carboxylic acid (8-methyl-8-aza-bicyclo[3.2.1]oct-3-yl)-amide | CHEMBL156920
TypeSmall organic molecule
Emp. Form.C23H24N4O3
Mol. Mass.404.4617
SMILESCN1C2CCC1CC(C2)NC(=O)c1c(O)c2cccnc2n(-c2ccccc2)c1=O