Reaction Details
TargetReverse transcriptase/RNaseH
LigandBDBM50013111
Substrate/Competitorn/a
Meas. Tech.ChEMBL_197124 (CHEMBL801614)
EC50 50±n/a nM
Citation Sergheraert, CPierlot, CTartar, AHenin, YLemaitre, M Synthesis and anti-HIV evaluation of D4T and D4T 5'-monophosphate prodrugs. J Med Chem36:826-30 (1993) Reverse transcriptase/RNaseH
Name:Reverse transcriptase/RNaseH
Type:PROTEIN
Mol. Mass.:65229.15
Organism:Human immunodeficiency virus 1
Description:ChEMBL_1473730
Residue:566
BDBM50013111
NameBDBM50013111
Synonyms:1-((2R,5S)-5-(hydroxymethyl)-2,5-dihydrofuran-2-yl)-5-methylpyrimidine-2,4(1H,3H)-dione 1-(5-Hydroxymethyl-2,5-dihydro-furan-2-yl)-5-methyl-1H-pyrimidine-2,4-dione 2',3'-didehydro-3'-deoxythymidine 3'-deoxy-2',3'-didehydrothymidine BMY-27857 STAVUDINE Zerit xr cid_5155 | d4T
TypeSmall organic molecule
Emp. Form.C10H12N2O4
Mol. Mass.224.2133
SMILESCc1cn([C@@H]2O[C@H](CO)C=C2)c(=O)[nH]c1=O