Reaction Details
TargetReverse transcriptase/RNaseH
LigandBDBM50044906
Substrate/Competitorn/a
Meas. Tech.ChEMBL_197124 (CHEMBL801614)
EC50 50±n/a nM
Citation Sergheraert, CPierlot, CTartar, AHenin, YLemaitre, M Synthesis and anti-HIV evaluation of D4T and D4T 5'-monophosphate prodrugs. J Med Chem36:826-30 (1993) Reverse transcriptase/RNaseH
Name:Reverse transcriptase/RNaseH
Type:PROTEIN
Mol. Mass.:65229.15
Organism:Human immunodeficiency virus 1
Description:ChEMBL_1473730
Residue:566
BDBM50044906
NameBDBM50044906
Synonyms:CHEMBL353179 | Phosphoric acid 8-(10,13-dimethyl-3-vinyloxy-2,3,4,7,8,9,10,11,12,13,14,15,16,17-tetradecahydro-1H-cyclopenta[a]phenanthren-17-yl)-octyl ester 5-(5-methyl-2,4-dioxo-3,4-dihydro-2H-pyrimidin-1-yl)-2,5-dihydro-furan-2-ylmethyl ester
TypeSmall organic molecule
Emp. Form.C39H59N2O8P
Mol. Mass.714.8681
SMILESCc1cn(C2OC(COP(O)(=O)OCCCCCCCCC3CCC4C5CC=C6C[C@H](CCC6(C)C5CCC34C)OC=C)C=C2)c(=O)[nH]c1=O