Reaction Details
TargetMuscarinic acetylcholine receptor M3
LigandBDBM50403547
Substrate/Competitorn/a
Meas. Tech.ChEMBL_98922 (CHEMBL708731)
Ki 0.120000±n/a nM
Citation McPherson, DWDeHaven-Hudkins, DLCallahan, APKnapp, FF Synthesis and biodistribution of iodine-125-labeled 1-azabicyclo[2.2.2]oct-3-yl alpha-hydroxy-alpha-(1-iodo-1-propen-3-yl)-alpha-phenylacetate. A new ligand for the potential imaging of muscarinic receptors by single photon emission computed tomography. J Med Chem36:848-54 (1993) Muscarinic acetylcholine receptor M3
Name:Muscarinic acetylcholine receptor M3
Type:Enzyme Catalytic Domain
Mol. Mass.:66086.66
Organism:RAT
Description:Cholinergic, muscarinic M3 CHRM3 RAT::P08483
Residue:589
BDBM50403547
NameBDBM50403547
Synonyms:ATROPEN | ATROPINE
TypeSmall organic molecule
Emp. Form.C17H23NO3
Mol. Mass.289.3694
SMILESCN1[C@H]2CC[C@@H]1C[C@@H](C2)OC(=O)C(CO)c1ccccc1