Reaction Details
TargetMuscarinic acetylcholine receptor M2
LigandBDBM50403547
Substrate/Competitorn/a
Meas. Tech.ChEMBL_98750 (CHEMBL704479)
Ki 0.760000±n/a nM
Citation McPherson, DWDeHaven-Hudkins, DLCallahan, APKnapp, FF Synthesis and biodistribution of iodine-125-labeled 1-azabicyclo[2.2.2]oct-3-yl alpha-hydroxy-alpha-(1-iodo-1-propen-3-yl)-alpha-phenylacetate. A new ligand for the potential imaging of muscarinic receptors by single photon emission computed tomography. J Med Chem36:848-54 (1993) Muscarinic acetylcholine receptor M2
Name:Muscarinic acetylcholine receptor M2
Type:Enzyme Catalytic Domain
Mol. Mass.:51555.53
Organism:RAT
Description:P10980
Residue:466
BDBM50403547
NameBDBM50403547
Synonyms:ATROPEN | ATROPINE
TypeSmall organic molecule
Emp. Form.C17H23NO3
Mol. Mass.289.3694
SMILESCN1[C@H]2CC[C@@H]1C[C@@H](C2)OC(=O)C(CO)c1ccccc1