Reaction Details
TargetMuscarinic acetylcholine receptor M2
LigandBDBM50456344
Substrate/Competitorn/a
Meas. Tech.ChEMBL_98750 (CHEMBL704479)
Ki 1.1±n/a nM
Citation McPherson, DWDeHaven-Hudkins, DLCallahan, APKnapp, FF Synthesis and biodistribution of iodine-125-labeled 1-azabicyclo[2.2.2]oct-3-yl alpha-hydroxy-alpha-(1-iodo-1-propen-3-yl)-alpha-phenylacetate. A new ligand for the potential imaging of muscarinic receptors by single photon emission computed tomography. J Med Chem36:848-54 (1993) Muscarinic acetylcholine receptor M2
Name:Muscarinic acetylcholine receptor M2
Type:Enzyme Catalytic Domain
Mol. Mass.:51555.53
Organism:RAT
Description:P10980
Residue:466
BDBM50456344
NameBDBM50456344
Synonyms:CHEMBL2112942
TypeSmall organic molecule
Emp. Form.C18H22INO3
Mol. Mass.427.2767
SMILESOC(CC=CI)(C(=O)OC1CN2CCC1CC2)c1ccccc1