Reaction Details
TargetProthrombin
LigandBDBM50046885
Substrate/Competitorn/a
Meas. Tech.ChEMBL_210580 (CHEMBL816531)
IC50 12000±n/a nM
Citation McConnell, RMYork, JLFrizzell, DEzell, C Inhibition studies of some serine and thiol proteinases by new leupeptin analogues. J Med Chem36:1084-9 (1993) Prothrombin
Name:Prothrombin
Type:Enzyme
Mol. Mass.:70502.73
Organism:Bos taurus (Bovine)
Description:P00735
Residue:625
BDBM50046885
NameBDBM50046885
Synonyms:2-(2-Acetylamino-3-phenyl-propionylamino)-N-(1-formyl-4-guanidino-butyl)-3-methyl-butyramide | CHEMBL2373041
TypeSmall organic molecule
Emp. Form.C22H34N6O4
Mol. Mass.446.5432
SMILES[#6]-[#6](-[#6])-[#6@H](-[#7]-[#6](=O)-[#6@H](-[#6]-c1ccccc1)-[#7]-[#6](-[#6])=O)-[#6](=O)-[#7]-[#6@@H](-[#6]-[#6]-[#6]\[#7]=[#6](\[#7])-[#7])-[#6]=O