Reaction Details
TargetPlasminogen
LigandBDBM50046897
Substrate/Competitorn/a
Meas. Tech.ChEMBL_155050 (CHEMBL764369)
IC50 54000±n/a nM
Citation McConnell, RMYork, JLFrizzell, DEzell, C Inhibition studies of some serine and thiol proteinases by new leupeptin analogues. J Med Chem36:1084-9 (1993) Plasminogen
Name:Plasminogen
Type:PROTEIN
Mol. Mass.:91228.25
Organism:Bos taurus
Description:ChEMBL_222778
Residue:812
BDBM50046897
NameBDBM50046897
Synonyms:2-Acetylamino-3-methyl-pentanoic acid [1-(1-formyl-4-guanidino-butylcarbamoyl)-3-methyl-butyl]-amide | CHEMBL2373047
TypeSmall organic molecule
Emp. Form.C20H38N6O4
Mol. Mass.426.5535
SMILES[#6]-[#6]-[#6@H](-[#6])-[#6@H](-[#7]-[#6](-[#6])=O)-[#6](=O)-[#7]-[#6@@H](-[#6]-[#6](-[#6])-[#6])-[#6](=O)-[#7]-[#6@@H](-[#6]-[#6]-[#6]\[#7]=[#6](\[#7])-[#7])-[#6]=O